Reaction Details
TargetCathepsin S
LigandBDBM19726
Substrate/CompetitorBDBM19546
Meas. Tech.Enzyme Inhibition Assay
pH5.5±n/a
Temperature310.15±n/a K
Ki 11±n/a nM
Citation Tully, DCLiu, HChatterjee, AKAlper, PBEpple, RWilliams, JARoberts, MJWoodmansee, DHMasick, BTTumanut, CLi, JSpraggon, GHornsby, MChang, JTuntland, THollenbeck, TGordon, PHarris, JLKaranewsky, DS Synthesis and SAR of arylaminoethyl amides as noncovalent inhibitors of cathepsin S: P3 cyclic ethers. Bioorg Med Chem Lett16:5112-7 (2006) 
 
Cathepsin S
Name:Cathepsin S
Type:Protein
Mol. Mass.:37507.38
Organism:Homo sapiens (Human)
Description:P25774
Residue:331
BDBM19726
BDBM19546
NameBDBM19726
Synonyms:(2S)-3-cyclohexyl-N-[(2S)-1-(5-fluoro-3,3-dimethyl-2,3-dihydro-1H-indol-1-yl)propan-2-yl]-2-(morpholin-4-ylcarbonylamino)propanamide | arylaminoethyl amide deriv. 40
TypeSmall organic molecule
Emp. Form.C27H41FN4O3
Mol. Mass.488.6378
SMILESC[C@@H](CN1CC(C)(C)c2cc(F)ccc12)NC(=O)[C@H](CC1CCCCC1)NC(=O)N1CCOCC1