Reaction Details
TargetCathepsin S
LigandBDBM19743
Substrate/CompetitorBDBM19963
Meas. Tech.Enzyme Inhibition Assay
IC50 0.9±n/a nM
Citation Altmann, EAichholz, RBetschart, CBuhl, TGreen, JIrie, OTeno, NLattmann, RTintelnot-Blomley, MMissbach, M 2-Cyano-pyrimidines: a new chemotype for inhibitors of the cysteine protease cathepsin K. J Med Chem50:591-4 (2007) 
 
Cathepsin S
Name:Cathepsin S
Type:Protein
Mol. Mass.:37507.38
Organism:Homo sapiens (Human)
Description:P25774
Residue:331
BDBM19743
BDBM19963
NameBDBM19743
Synonyms:2-Cyano-pyrimidine, 17h | 2-cyano-4-[(2,2-dimethylpropyl)amino]-N-(2-{4-[2-(1H-imidazol-1-yl)ethoxy]phenyl}ethyl)pyrimidine-5-carboxamide
TypeSmall organic molecule
Emp. Form.C24H29N7O2
Mol. Mass.447.5328
SMILESCC(C)(C)CNc1nc(ncc1C(=O)NCCc1ccc(OCCn2ccnc2)cc1)C#N