Reaction Details
TargetNuclear receptor ROR-gamma
LigandBDBM362868
Substrate/Competitorn/a
Meas. Tech.Binding Assay
Ki<100±n/a nM
Citation Claremon, DADillard, LWDong, CFan, YJia, LLotesta, SDMarcus, ASingh, SBTice, CMYuan, JZhao, WZheng, YZhuang, L Isoindoline inhibitors of ROR-gamma US Patent US9845308 Publication Date 12/19/2017
 
Nuclear receptor ROR-gamma
Name:Nuclear receptor ROR-gamma
Type:Enzyme Catalytic Domain
Mol. Mass.:58218.40
Organism:Homo sapiens (Human)
Description:P51449
Residue:518
BDBM362868
NameBDBM362868
Synonyms:US9845308, Example 4a | US9845308, Example 5a
TypeSmall organic molecule
Emp. Form.C27H40F3N3O3S
Mol. Mass.543.685
SMILESCC(C)[C@@H]1N(C[C@H]2CC[C@@H](CC2)C(F)(F)F)Cc2cc(ccc12)C(=O)NCC1CCN(CC1)S(C)(=O)=O