Reaction Details
TargetNuclear receptor ROR-gamma
LigandBDBM362918
Substrate/Competitorn/a
Meas. Tech.Binding Assay
Ki<100±n/a nM
Citation Claremon, DADillard, LWDong, CFan, YJia, LLotesta, SDMarcus, ASingh, SBTice, CMYuan, JZhao, WZheng, YZhuang, L Isoindoline inhibitors of ROR-gamma US Patent US9845308 Publication Date 12/19/2017
 
Nuclear receptor ROR-gamma
Name:Nuclear receptor ROR-gamma
Type:Enzyme Catalytic Domain
Mol. Mass.:58218.40
Organism:Homo sapiens (Human)
Description:P51449
Residue:518
BDBM362918
NameBDBM362918
Synonyms:US9845308, Example 27
TypeSmall organic molecule
Emp. Form.C28H28F3N3O4S
Mol. Mass.559.6
SMILESCCS(=O)(=O)c1ccc(CNC(=O)c2ccc3C(C(C)C)N(Cc4ccc(cc4)C(F)(F)F)C(=O)c3c2)nc1