Reaction Details
TargetCathepsin L2
LigandBDBM19778
Substrate/CompetitorBDBM19485
Meas. Tech.Enzyme Inhibition Assay
Ki 0.063±n/a nM
Citation Yamashita, DSMarquis, RWXie, RNidamarthy, SDOh, HJJeong, JUErhard, KFWard, KWRoethke, TJSmith, BRCheng, HYGeng, XLin, FOffen, PHWang, BNevins, NHead, MSHaltiwanger, RCNarducci Sarjeant, AALiable-Sands, LMZhao, BSmith, WWJanson, CAGao, ETomaszek, TMcQueney, MJames, IEGress, CJZembryki, DLLark, MWVeber, DF Structure activity relationships of 5-, 6-, and 7-methyl-substituted azepan-3-one cathepsin K inhibitors. J Med Chem49:1597-612 (2006) 
 
Cathepsin L2
Name:Cathepsin L2
Type:Enzyme
Mol. Mass.:37341.06
Organism:Homo sapiens (Human)
Description:O60911
Residue:334
BDBM19778
BDBM19485
NameBDBM19778
Synonyms:(2S)-2-(1-benzofuran-2-ylformamido)-4-methyl-N-[(4S,7R)-7-methyl-3-oxo-1-(pyridine-2-sulfonyl)azepan-4-yl]pentanamide CHEMBL203665
TypeSmall organic molecule
Emp. Form.C27H32N4O6S
Mol. Mass.540.631
SMILESCC(C)C[C@H](NC(=O)c1cc2ccccc2o1)C(=O)N[C@H]1CC[C@@H](C)N(CC1=O)S(=O)(=O)c1ccccn1