Reaction Details
TargetCathepsin B
LigandBDBM19771
Substrate/CompetitorBDBM19485
Meas. Tech.Enzyme Inhibition Assay
Ki>1000±n/a nM
Citation Yamashita, DSMarquis, RWXie, RNidamarthy, SDOh, HJJeong, JUErhard, KFWard, KWRoethke, TJSmith, BRCheng, HYGeng, XLin, FOffen, PHWang, BNevins, NHead, MSHaltiwanger, RCNarducci Sarjeant, AALiable-Sands, LMZhao, BSmith, WWJanson, CAGao, ETomaszek, TMcQueney, MJames, IEGress, CJZembryki, DLLark, MWVeber, DF Structure activity relationships of 5-, 6-, and 7-methyl-substituted azepan-3-one cathepsin K inhibitors. J Med Chem49:1597-612 (2006) 
 
Cathepsin B
Name:Cathepsin B
Type:Enzyme
Mol. Mass.:37819.69
Organism:Homo sapiens (Human)
Description:gi_63102437
Residue:339
BDBM19771
BDBM19485
NameBDBM19771
Synonyms:(2S)-2-(1-benzofuran-2-ylformamido)-4-methyl-N-[(4S,5R)-5-methyl-3-oxo-1-(pyridine-2-sulfonyl)azepan-4-yl]pentanamide | Azepan-3-one compound 3
TypeSmall organic molecule
Emp. Form.C27H32N4O6S
Mol. Mass.540.631
SMILESCC(C)C[C@H](NC(=O)c1cc2ccccc2o1)C(=O)N[C@H]1[C@H](C)CCN(CC1=O)S(=O)(=O)c1ccccn1