Reaction Details
TargetCathepsin K
LigandBDBM19777
Substrate/CompetitorBDBM19485
Meas. Tech.Enzyme Inhibition Assay
Ki 660±n/a nM
Citation Yamashita, DSMarquis, RWXie, RNidamarthy, SDOh, HJJeong, JUErhard, KFWard, KWRoethke, TJSmith, BRCheng, HYGeng, XLin, FOffen, PHWang, BNevins, NHead, MSHaltiwanger, RCNarducci Sarjeant, AALiable-Sands, LMZhao, BSmith, WWJanson, CAGao, ETomaszek, TMcQueney, MJames, IEGress, CJZembryki, DLLark, MWVeber, DF Structure activity relationships of 5-, 6-, and 7-methyl-substituted azepan-3-one cathepsin K inhibitors. J Med Chem49:1597-612 (2006) 
 
Cathepsin K
Name:Cathepsin K
Type:PROTEIN
Mol. Mass.:36798.82
Organism:Rattus norvegicus
Description:ChEMBL_633322
Residue:329
BDBM19777
BDBM19485
NameBDBM19777
Synonyms:(2S)-2-(1-benzofuran-2-ylformamido)-4-methyl-N-[(4R,6S)-6-methyl-3-oxo-1-(pyridine-2-sulfonyl)azepan-4-yl]pentanamide | Azepan-3-one compound 9
TypeSmall organic molecule
Emp. Form.C27H32N4O6S
Mol. Mass.540.631
SMILESCC(C)C[C@H](NC(=O)c1cc2ccccc2o1)C(=O)N[C@@H]1C[C@H](C)CN(CC1=O)S(=O)(=O)c1ccccn1