Reaction Details
TargetCathepsin K
LigandBDBM19797
Substrate/CompetitorBDBM19485
Meas. Tech.In Vitro Enzyme Inhibition Assay
pH5.5±n/a
Temperature295.15±n/a K
Ki 60±n/a nM
Citation Marquis, RWRu, YZeng, JTrout, RELoCastro, SMGribble, ADWitherington, JFenwick, AEGarnier, BTomaszek, TTew, DHemling, MEQuinn, CJSmith, WWZhao, BMcQueney, MSJanson, CAD'Alessio, KVeber, DF Cyclic ketone inhibitors of the cysteine protease cathepsin K. J Med Chem44:725-36 (2001) 
 
Cathepsin K
Name:Cathepsin K
Type:Enzyme
Mol. Mass.:36975.68
Organism:Homo sapiens (Human)
Description:P43235
Residue:329
BDBM19797
BDBM19485
NameBDBM19797
Synonyms:CHEMBL301683 benzyl N-[(1S)-1-{[(2S)-4-methoxy-3-oxobutan-2-yl]carbamoyl}-3-methylbutyl]carbamate
TypeSmall organic molecule
Emp. Form.C19H28N2O5
Mol. Mass.364.436
SMILESCOCC(=O)[C@H](C)NC(=O)[C@H](CC(C)C)NC(=O)OCc1ccccc1