Reaction Details
TargetCathepsin K
LigandBDBM19835
Substrate/CompetitorBDBM19480
Meas. Tech.Enzyme Inhibition Assay
pH5.5±n/a
Temperature295.15±n/a K
IC50 150±n/a nM
Citation Crane, SNBlack, WCPalmer, JTDavis, DESetti, ERobichaud, JPaquet, JOballa, RMBayly, CIMcKay, DJSomoza, JRChauret, NSeto, CScheigetz, JWesolowski, GMassé, FDesmarais, SOuellet, M Beta-substituted cyclohexanecarboxamide: a nonpeptidic framework for the design of potent inhibitors of cathepsin K. J Med Chem49:1066-79 (2006) 
 
Cathepsin K
Name:Cathepsin K
Type:Enzyme
Mol. Mass.:36879.51
Organism:Oryctolagus cuniculus (rabbit)
Description:n/a
Residue:329
BDBM19835
BDBM19480
NameBDBM19835
Synonyms:(1R,2R)-N-(cyanomethyl)-2-{[(2,5-dichlorophenyl)sulfanyl]methyl}cyclohexane-1-carboxamide racemic mixture
TypeSmall organic molecule
Emp. Form.C16H18Cl2N2OS
Mol. Mass.357.298
SMILESClc1ccc(Cl)c(SC[C@@H]2CCCC[C@H]2C(=O)NCC#N)c1