Reaction Details
TargetP2X purinoceptor 3
LigandBDBM244385
Substrate/Competitorn/a
Meas. Tech.Receptor Inhibition Assay
pH7.5±n/a
IC50 1.000±n/a nM
Commentsextracted
Citation Kai, HTanaka, SHiramatsu, YNozu, ANakamura, K Heterocyclic ring and carbocyclic derivative US Patent US9550763 Publication Date 1/24/2017
 
P2X purinoceptor 3
Name:P2X purinoceptor 3
Type:Protein
Mol. Mass.:44292.02
Organism:Homo sapiens (Human)
Description:P56373
Residue:397
BDBM244385
NameBDBM244385
Synonyms:US9550763, Compound I-137
TypeSmall organic molecule
Emp. Form.C28H27ClN6O4
Mol. Mass.547.005
SMILESCc1ccc(Oc2ccc(Nc3ncc(NC(=O)C4CCOCC4)c(=O)n3Cc3ccc(Cl)cc3)cc2)nn1