Reaction Details
TargetEstrogen receptor
LigandBDBM19967
Substrate/Competitor17beta-estradiol (E2)
Meas. Tech.Estrogen Receptor Binding Assay and Ishikawa Assay
pH7.5±n/a
Temperature295.15±n/a K
Ki 0.25±0.09 nM
EC50 3.18±1.18 nM
Citation Hummel, CWGeiser, AGBryant, HUCohen, IRDally, RDFong, KCFrank, SAHinklin, RJones, SALewis, GMcCann, DJRudmann, DGShepherd, TATian, HWallace, OBWang, MWang, YDodge, JA A selective estrogen receptor modulator designed for the treatment of uterine leiomyoma with unique tissue specificity for uterus and ovaries in rats. J Med Chem48:6772-5 (2005) 
 
Estrogen receptor
Name:Estrogen receptor
Type:Protein
Mol. Mass.:66230.44
Organism:Homo sapiens (Human)
Description:P03372
Residue:595
BDBM19967
17beta-estradiol (E2)
NameBDBM19967
Synonyms:6-(4-fluorophenyl)-5-{4-[2-(piperidin-1-yl)ethoxy]phenoxy}naphthalen-2-ol LY2066948 analogue, 17
TypeSmall organic molecule
Emp. Form.C29H28FNO3
Mol. Mass.457.5359
SMILESOc1ccc2c(Oc3ccc(OCCN4CCCCC4)cc3)c(ccc2c1)-c1ccc(F)cc1