Reaction Details
TargetEstrogen receptor beta
LigandBDBM19968
Substrate/Competitor17beta-estradiol (E2)
Meas. Tech.Estrogen Receptor Binding Assay and Cell-Based Transcriptional Assay
pH7.5±n/a
Temperature295.15±n/a K
Ki 0.19±0.01 nM
EC50 0.66±0.04 nM
CommentsEfficacy=101%
Citation Norman, BHDodge, JARichardson, TIBorromeo, PSLugar, CWJones, SAChen, KWang, YDurst, GLBarr, RJMontrose-Rafizadeh, COsborne, HEAmos, RMGuo, SBoodhoo, AKrishnan, V Benzopyrans are selective estrogen receptor beta agonists with novel activity in models of benign prostatic hyperplasia. J Med Chem49:6155-7 (2006) 
 
Estrogen receptor beta
Name:Estrogen receptor beta
Type:Protein
Mol. Mass.:59238.43
Organism:Homo sapiens (Human)
Description:Q92731
Residue:530
BDBM19968
17beta-estradiol (E2)
NameBDBM19968
Synonyms:(2R,6S,7R)-7-(4-hydroxyphenyl)-8-oxatricyclo[7.4.0.0^{2,6}]trideca-1(13),9,11-trien-12-ol Benzopyran derivative., 4b(racemate) racemic mixture
TypeSmall organic molecule
Emp. Form.C18H18O3
Mol. Mass.282.3337
SMILESOc1ccc(cc1)[C@@H]1Oc2ccc(O)cc2[C@@H]2CCC[C@H]12