Reaction Details
TargetPapain
LigandBDBM20094
Substrate/CompetitorBDBM20081
Meas. Tech.Papain Inhibition Assay
pH6.5±n/a
Temperature298.15±n/a K
Ki 83000±2000 nM
Km965000±244000 nM
Citation Löser, RSchilling, KDimmig, EGütschow, M Interaction of papain-like cysteine proteases with dipeptide-derived nitriles. J Med Chem48:7688-707 (2005) 
 
Papain
Name:Papain
Type:Enzyme
Mol. Mass.:38923.01
Organism:Carica papaya
Description:Papain was purchased from Sigma, Germany.
Residue:345
BDBM20094
BDBM20081
NameBDBM20094
Synonyms:dipeptide-derived nitrile, 15 | tert-butyl N-[(S)-[(cyanomethyl)carbamoyl](phenyl)methyl]carbamate
TypeSmall organic molecule
Emp. Form.C15H19N3O3
Mol. Mass.289.3297
SMILESCC(C)(C)OC(=O)N[C@H](C(=O)NCC#N)c1ccccc1