Reaction Details
TargetPapain
LigandBDBM20098
Substrate/CompetitorBDBM20081
Meas. Tech.Papain Inhibition Assay
pH6.5±n/a
Temperature298.15±n/a K
Ki 190±10 nM
Km965000±244000 nM
Citation Löser, RSchilling, KDimmig, EGütschow, M Interaction of papain-like cysteine proteases with dipeptide-derived nitriles. J Med Chem48:7688-707 (2005) 
 
Papain
Name:Papain
Type:Enzyme
Mol. Mass.:38923.01
Organism:Carica papaya
Description:Papain was purchased from Sigma, Germany.
Residue:345
BDBM20098
BDBM20081
NameBDBM20098
Synonyms:dipeptide-derived nitrile, 19 | tert-butyl N-[(1S)-1-[(cyanomethyl)carbamoyl]-2-(thiophen-2-yl)ethyl]carbamate
TypeSmall organic molecule
Emp. Form.C14H19N3O3S
Mol. Mass.309.384
SMILESCC(C)(C)OC(=O)N[C@@H](Cc1cccs1)C(=O)NCC#N