Reaction Details
TargetPapain
LigandBDBM20118
Substrate/CompetitorBDBM20081
Meas. Tech.Papain Inhibition Assay
Ki 380±n/a nM
Citation Löser, RSchilling, KDimmig, EGütschow, M Interaction of papain-like cysteine proteases with dipeptide-derived nitriles. J Med Chem48:7688-707 (2005) 
 
Papain
Name:Papain
Type:Enzyme
Mol. Mass.:38923.01
Organism:Carica papaya
Description:Papain was purchased from Sigma, Germany.
Residue:345
BDBM20118
BDBM20081
NameBDBM20118
Synonyms:(2S)-N-(cyanomethyl)-2-acetamido-3-phenylpropanamide | phenylalanine derivative, 42
TypeSmall organic molecule
Emp. Form.C13H15N3O2
Mol. Mass.245.2771
SMILESCC(=O)N[C@@H](Cc1ccccc1)C(=O)NCC#N