Reaction Details
TargetPapain
LigandBDBM20120
Substrate/CompetitorBDBM20081
Meas. Tech.Papain Inhibition Assay
Ki 16±n/a nM
Citation Löser, RSchilling, KDimmig, EGütschow, M Interaction of papain-like cysteine proteases with dipeptide-derived nitriles. J Med Chem48:7688-707 (2005) 
 
Papain
Name:Papain
Type:Enzyme
Mol. Mass.:38923.01
Organism:Carica papaya
Description:Papain was purchased from Sigma, Germany.
Residue:345
BDBM20120
BDBM20081
NameBDBM20120
Synonyms:(2S)-N-(cyanomethyl)-3-phenyl-2-[(4-phenylphenyl)formamido]propanamide | phenylalanine derivative, 44
TypeSmall organic molecule
Emp. Form.C24H21N3O2
Mol. Mass.383.4424
SMILESO=C(NCC#N)[C@H](Cc1ccccc1)NC(=O)c1ccc(cc1)-c1ccccc1