Reaction Details
TargetHigh affinity nerve growth factor receptor
LigandBDBM364459
Substrate/Competitorn/a
Meas. Tech.Biological Assay
IC50 0.250±n/a nM
Citation Mitchell, HWood, HBLi, CSMao, QQi, Z TrkA kinase inhibitors, compositions and methods thereof US Patent US9862707 Publication Date 1/9/2018
 
High affinity nerve growth factor receptor
Name:High affinity nerve growth factor receptor
Type:n/a
Mol. Mass.:87498.18
Organism:Homo sapiens (Human)
Description:P04629
Residue:796
BDBM364459
NameBDBM364459
Synonyms:(R or S)-2-fluoro-N-[6-(1- hydroxyethyl)-2-phenyl-2H- pyrazolo[4,3-b]pyridin-3-yl]-5-(1- methyl-1H-pyrazol-3-yl)-4- (trifluoromethyl)benzamide, isomer A US9862707, Example 34
TypeSmall organic molecule
Emp. Form.C26H20F4N6O2
Mol. Mass.524.4696
SMILESCC(O)c1cnc2c(NC(=O)c3cc(-c4ccn(C)n4)c(cc3F)C(F)(F)F)n(nc2c1)-c1ccccc1