Reaction Details
TargetKappa-type opioid receptor
LigandBDBM364549
Substrate/Competitorn/a
Meas. Tech.kappa-Opioid Receptor Binding Assay
Ki 0.096±0.026 nM
Citation Youngman, M Opioid receptor modulating oxabicyclo[2.2.2]octane morphinans US Patent US9862726 Publication Date 1/9/2018
 
Kappa-type opioid receptor
Name:Kappa-type opioid receptor
Type:G Protein-Coupled Receptor (GPCR)
Mol. Mass.:42648.76
Organism:Homo sapiens (Human)
Description:P41145
Residue:380
BDBM364549
NameBDBM364549
Synonyms:(4bR,6S,8aS,9R)-6-amino-11- (cyclopropylmethyl)-5,6,7,8,9,10- hexahydro- 9,4b-(epiminoethano)-8a,6- (epoxymethano)phenanthren-3-ol | US9862726, Compound 17
TypeSmall organic molecule
Emp. Form.C21H28N2O2
Mol. Mass.340.4592
SMILESNC12CC[C@@]3(OC1)[C@H]1Cc4ccc(O)cc4[C@@]3(CCN1CC1CC1)C2