Reaction Details
TargetMu-type opioid receptor
LigandBDBM364562
Substrate/Competitorn/a
Meas. Tech.Mu-Opioid Receptor Binding Assay
Ki 0.019±0.01 nM
Citation Youngman, M Opioid receptor modulating oxabicyclo[2.2.2]octane morphinans US Patent US9862726 Publication Date 1/9/2018
 
Mu-type opioid receptor
Name:Mu-type opioid receptor
Type:G Protein-Coupled Receptor (GPCR)
Mol. Mass.:44789.51
Organism:Homo sapiens (Human)
Description:P35372
Residue:400
BDBM364562
NameBDBM364562
Synonyms:N-((4bR,6S,8aS,9R)-11- (cyclopropylmethyl)- 3-hydroxy-5,6,7,8,9,10-hexahydro-9,4b- (epiminoethano)-8a,6- (epoxymethano)phenanthren-6- yl)benzamide | US9862726, Compound 27
TypeSmall organic molecule
Emp. Form.C28H32N2O3
Mol. Mass.444.5653
SMILESOc1ccc2C[C@H]3N(CC4CC4)CC[C@@]4(CC5(CC[C@@]34OC5)NC(=O)c3ccccc3)c2c1