Reaction Details
TargetP2X purinoceptor 7
LigandBDBM160076
Substrate/Competitorn/a
Meas. Tech.P2X7 FLIPR Assay
pH7.4±n/a
IC50<1.000±n/a nM
Commentsextracted
Citation Ameriks, MKRech, JCSavall, BMWall, JL Substituted [1,2,4]triazolo[4,3-a]pyrazines as P2X7 modulators US Patent US10053463 Publication Date 8/21/2018
 
P2X purinoceptor 7
Name:P2X purinoceptor 7
Type:Protein
Mol. Mass.:68602.85
Organism:Homo sapiens (Human)
Description:Q99572
Residue:595
BDBM160076
NameBDBM160076
Synonyms:US10047092, 17 US9040534, 17
TypeSmall organic molecule
Emp. Form.C20H15ClF4N4O
Mol. Mass.438.806
SMILESC[C@H]1Cn2c(nnc2-c2ccc(F)cc2)C(=O)N1Cc1cccc(c1Cl)C(F)(F)F