Reaction Details
TargetP2X purinoceptor 7
LigandBDBM160085
Substrate/Competitorn/a
Meas. Tech.P2X7 FLIPR Assay
pH7.4±n/a
IC50 375±n/a nM
Commentsextracted
Citation Ameriks, MKRech, JCSavall, BMWall, JL Substituted [1,2,4]triazolo[4,3-a]pyrazines as P2X7 modulators US Patent US10053463 Publication Date 8/21/2018
 
P2X purinoceptor 7
Name:P2X purinoceptor 7
Type:PROTEIN
Mol. Mass.:68405.16
Organism:Mus musculus
Description:ChEMBL_1473824
Residue:595
BDBM160085
NameBDBM160085
Synonyms:US10047092, 26 US9040534, 26
TypeSmall organic molecule
Emp. Form.C18H16ClF3N6O
Mol. Mass.424.807
SMILESC[C@H]1Cn2c(nnc2C(=O)N1Cc1cccc(c1Cl)C(F)(F)F)-c1cc(C)[nH]n1