Reaction Details
TargetP2X purinoceptor 7
LigandBDBM160091
Substrate/Competitorn/a
Meas. Tech.P2X7 Radioligand Binding
Ki 2.00±n/a nM
Citation Ameriks, MKRech, JCSavall, BMWall, JL Substituted [1,2,4]triazolo[4,3-a]pyrazines as P2X7 modulators US Patent US10053463 Publication Date 8/21/2018
 
P2X purinoceptor 7
Name:P2X purinoceptor 7
Type:Protein
Mol. Mass.:68602.85
Organism:Homo sapiens (Human)
Description:Q99572
Residue:595
BDBM160091
NameBDBM160091
Synonyms:US10047092, 32 US9040534, 32
TypeSmall organic molecule
Emp. Form.C17H13ClF3N5OS
Mol. Mass.427.831
SMILESC[C@H]1Cn2c(nnc2C(=O)N1Cc1cccc(c1Cl)C(F)(F)F)-c1cscn1