Reaction Details
TargetP2X purinoceptor 7
LigandBDBM160093
Substrate/Competitorn/a
Meas. Tech.P2X7 Radioligand Binding
Ki 2.80±n/a nM
Citation Ameriks, MKRech, JCSavall, BMWall, JL Substituted [1,2,4]triazolo[4,3-a]pyrazines as P2X7 modulators US Patent US10053463 Publication Date 8/21/2018
 
P2X purinoceptor 7
Name:P2X purinoceptor 7
Type:PROTEIN
Mol. Mass.:68405.16
Organism:Mus musculus
Description:ChEMBL_1473824
Residue:595
BDBM160093
NameBDBM160093
Synonyms:US10047092, 34 US9040534, 34
TypeSmall organic molecule
Emp. Form.C18H13ClF4N6O
Mol. Mass.440.782
SMILESC[C@H]1Cn2c(nnc2-c2ncc(F)cn2)C(=O)N1Cc1cccc(c1Cl)C(F)(F)F