Reaction Details
TargetTransient receptor potential cation channel subfamily V member 1
LigandBDBM20321
Substrate/CompetitorBDBM20285
Meas. Tech.Competition Binding Assay and Inhibition of Ca2+ Uptake Assay
pH7.4±n/a
Temperature310.15±n/a K
Ki 53.5±6.5 nM
EC50 9.2±1.6 nM
Citation Chung, JUKim, SYLim, JOChoi, HKKang, SUYoon, HSRyu, HKang, DWLee, JKang, BChoi, SToth, APearce, LVPavlyukovets, VALundberg, DJBlumberg, PM Alpha-substituted N-(4-tert-butylbenzyl)-N'-[4-(methylsulfonylamino)benzyl]thiourea analogues as potent and stereospecific TRPV1 antagonists. Bioorg Med Chem15:6043-53 (2007) 
 
Transient receptor potential cation channel subfamily V member 1
Name:Transient receptor potential cation channel subfamily V member 1
Type:Transient Receptor
Mol. Mass.:94956.12
Organism:Rattus norvegicus (rat)
Description:O35433
Residue:838
BDBM20321
BDBM20285
NameBDBM20321
Synonyms:3-[(4-tert-butylphenyl)methyl]-1-[(3-fluoro-4-methanesulfonamidophenyl)methyl]thiourea JYL1421 | thiourea analogue, 2
TypeSmall organic molecule
Emp. Form.C20H26FN3O2S2
Mol. Mass.423.568
SMILESCC(C)(C)c1ccc(CNC(=S)NCc2ccc(NS(C)(=O)=O)c(F)c2)cc1