Reaction Details
TargetEstrogen receptor
LigandBDBM20622
Substrate/Competitor17beta-estradiol (E2)
Meas. Tech.ER-alpha Radioligand Binding Assay and ERE-Luciferase Reporter Assay.
pH7.4±n/a
Temperature295.15±n/a K
IC50 123±33 nM
EC50 19.6±6.5 nM
CommentsAntagonist activity in MCF-7 assay, IC50= 59 +/- 21 nM, 100% antagonism; in the absence of 17beta-estradiol in the MCF-7 proliferation assay, compound displayed 5 +/- 3 % agonistic effect.
Citation Renaud, JBischoff, SFBuhl, TFloersheim, PFournier, BGeiser, MHalleux, CKallen, JKeller, HRamage, P Selective estrogen receptor modulators with conformationally restricted side chains. Synthesis and structure-activity relationship of ERalpha-selective tetrahydroisoquinoline ligands. J Med Chem48:364-79 (2005) 
 
Estrogen receptor
Name:Estrogen receptor
Type:Protein
Mol. Mass.:66230.44
Organism:Homo sapiens (Human)
Description:P03372
Residue:595
BDBM20622
17beta-estradiol (E2)
NameBDBM20622
Synonyms:1-[4-(4-cyclopentylpiperazin-1-yl)phenyl]-2-(3-hydroxyphenyl)-1,2,3,4-tetrahydroisoquinolin-6-ol | Piperazine Derivative, 49
TypeSmall organic molecule
Emp. Form.C30H35N3O2
Mol. Mass.469.6178
SMILESOc1ccc2C(N(CCc2c1)c1cccc(O)c1)c1ccc(cc1)N1CCN(CC1)C1CCCC1