Reaction Details
TargetEstrogen receptor beta
LigandBDBM20606
Substrate/Competitor17beta-estradiol (E2)
Meas. Tech.ER-alpha Radioligand Binding Assay and ERE-Luciferase Reporter Assay.
Temperature298.15±n/a K
IC50 13±n/a nM
EC50 24±n/a nM
Commentsextracted
Citation Renaud, JBischoff, SFBuhl, TFloersheim, PFournier, BGeiser, MHalleux, CKallen, JKeller, HRamage, P Selective estrogen receptor modulators with conformationally restricted side chains. Synthesis and structure-activity relationship of ERalpha-selective tetrahydroisoquinoline ligands. J Med Chem48:364-79 (2005) 
 
Estrogen receptor beta
Name:Estrogen receptor beta
Type:Protein
Mol. Mass.:59238.43
Organism:Homo sapiens (Human)
Description:Q92731
Residue:530
BDBM20606
17beta-estradiol (E2)
NameBDBM20606
Synonyms:(5R,6S)-6-phenyl-5-[4-(2-pyrrolidin-1-ylethoxy)phenyl]-5,6,7,8-tetrahydronaphthalen-2-ol CHEMBL328190 Oporia
TypeSmall organic molecule
Emp. Form.C28H31NO2
Mol. Mass.413.5512
SMILESOc1ccc2[C@H]([C@H](CCc2c1)c1ccccc1)c1ccc(OCCN2CCCC2)cc1