Reaction Details
Target3-phosphoinositide-dependent protein kinase 1 [51-360]
LigandBDBM366312
Substrate/Competitorn/a
Meas. Tech.Kinase Assay
IC50<500±n/a nM
Citation Lind, KECao, KLin, EYNguyen, TBTangonan, BTErlanson, DAGuckian, KSimmons, RLLee, WSun, LHansen, SPathan, NZhang, L Methods of treatment using pyridinonyl PDK1 inhibitors US Patent US9873693 Publication Date 1/23/2018
 
3-phosphoinositide-dependent protein kinase 1 [51-360]
Name:3-phosphoinositide-dependent protein kinase 1 [51-360]
Type:Enzyme Catalytic Domain
Mol. Mass.:35373.34
Organism:Homo sapiens (Human)
Description:(aa 51-360)
Residue:310
BDBM366312
NameBDBM366312
Synonyms:US9873693, Compound 237
TypeSmall organic molecule
Emp. Form.C29H25F2N5O3S
Mol. Mass.561.602
SMILESCN(C)C(=O)C[C@@H](NC(=O)c1cccn(Cc2ccc(F)c(F)c2)c1=O)c1ccc(s1)-c1c[nH]c2ncccc12