Reaction Details
Target3-phosphoinositide-dependent protein kinase 1 [51-360]
LigandBDBM366332
Substrate/Competitorn/a
Meas. Tech.Kinase Assay
IC50<500±n/a nM
Citation Lind, KECao, KLin, EYNguyen, TBTangonan, BTErlanson, DAGuckian, KSimmons, RLLee, WSun, LHansen, SPathan, NZhang, L Methods of treatment using pyridinonyl PDK1 inhibitors US Patent US9873693 Publication Date 1/23/2018
 
3-phosphoinositide-dependent protein kinase 1 [51-360]
Name:3-phosphoinositide-dependent protein kinase 1 [51-360]
Type:Enzyme Catalytic Domain
Mol. Mass.:35373.34
Organism:Homo sapiens (Human)
Description:(aa 51-360)
Residue:310
BDBM366332
NameBDBM366332
Synonyms:US9873693, Compound 259
TypeSmall organic molecule
Emp. Form.C25H26ClN5O3
Mol. Mass.479.959
SMILESCOc1ccnc(NCCC#CCCNC(=O)c2cccn([C@H](C)c3ccc(Cl)cc3)c2=O)n1