Reaction Details
Target3-hydroxy-3-methylglutaryl-coenzyme A reductase
LigandBDBM20688
Substrate/CompetitorBDBM18373
Meas. Tech.HMG-CoA Reductase Enzyme Assay and Inhibition of Cellular Cholesterol Synthesis Assay
pH7.2±n/a
Temperature310.15±n/a K
IC50 13±1 nM
EC50 17±2 nM
Citation Pfefferkorn, JAChoi, CLarsen, SDAuerbach, BHutchings, RPark, WAskew, VDillon, LHanselman, JCLin, ZLu, GHRobertson, ASekerke, CHarris, MSPavlovsky, ABainbridge, GCaspers, NKowala, MTait, BD Substituted pyrazoles as hepatoselective HMG-CoA reductase inhibitors: discovery of (3R,5R)-7-[2-(4-fluoro-phenyl)-4-isopropyl-5-(4-methyl-benzylcarbamoyl)-2H-pyrazol-3-yl]-3,5-dihydroxyheptanoic acid (PF-3052334) as a candidate for the treatment of hypercholesterolemia. J Med Chem51:31-45 (2008) 
 
3-hydroxy-3-methylglutaryl-coenzyme A reductase
Name:3-hydroxy-3-methylglutaryl-coenzyme A reductase
Type:Enzyme
Mol. Mass.:96689.85
Organism:Rattus norvegicus (rat)
Description:Isolated rat liver microsomes were used as enzyme source.
Residue:887
BDBM20688
BDBM18373
NameBDBM20688
Synonyms:(3R,5R)-7-[(1S,2S,6S,8S,8aR)-6-hydroxy-2-methyl-8-{[(2S)-2-methylbutanoyl]oxy}-1,2,6,7,8,8a-hexahydronaphthalen-1-yl]-3,5-dihydroxyheptanoic acid Pravastatin
TypeSmall organic molecule
Emp. Form.C23H36O7
Mol. Mass.424.5277
SMILES[H][C@]12[C@H](C[C@H](O)C=C1C=C[C@H](C)[C@@H]2CC[C@@H](O)C[C@@H](O)CC(O)=O)OC(=O)[C@@H](C)CC