Reaction Details
Target3-hydroxy-3-methylglutaryl-coenzyme A reductase
LigandBDBM20691
Substrate/CompetitorBDBM18373
Meas. Tech.HMG-CoA Reductase Enzyme Assay and Inhibition of Cellular Cholesterol Synthesis Assay
pH7.2±n/a
Temperature310.15±n/a K
IC50 3.8±0.5 nM
EC50 0.7±n/a nM
Citation Pfefferkorn, JAChoi, CLarsen, SDAuerbach, BHutchings, RPark, WAskew, VDillon, LHanselman, JCLin, ZLu, GHRobertson, ASekerke, CHarris, MSPavlovsky, ABainbridge, GCaspers, NKowala, MTait, BD Substituted pyrazoles as hepatoselective HMG-CoA reductase inhibitors: discovery of (3R,5R)-7-[2-(4-fluoro-phenyl)-4-isopropyl-5-(4-methyl-benzylcarbamoyl)-2H-pyrazol-3-yl]-3,5-dihydroxyheptanoic acid (PF-3052334) as a candidate for the treatment of hypercholesterolemia. J Med Chem51:31-45 (2008) 
 
3-hydroxy-3-methylglutaryl-coenzyme A reductase
Name:3-hydroxy-3-methylglutaryl-coenzyme A reductase
Type:Enzyme
Mol. Mass.:96689.85
Organism:Rattus norvegicus (rat)
Description:Isolated rat liver microsomes were used as enzyme source.
Residue:887
BDBM20691
BDBM18373
NameBDBM20691
Synonyms:pyrazole-based inhibitor, 34 | sodium (3R,5R)-7-[1-(4-fluorophenyl)-3-{[(4-fluorophenyl)methyl]carbamoyl}-4-(propan-2-yl)-1H-pyrazol-5-yl]-3,5-dihydroxyheptanoate
TypeSmall organic molecule
Emp. Form.C27H30F2N3O5
Mol. Mass.514.5416
SMILESCC(C)c1c(CC[C@@H](O)C[C@@H](O)CC([O-])=O)n(nc1C(=O)NCc1ccc(F)cc1)-c1ccc(F)cc1