Reaction Details
Target3-hydroxy-3-methylglutaryl-coenzyme A reductase
LigandBDBM20694
Substrate/CompetitorBDBM18373
Meas. Tech.HMG-CoA Reductase Enzyme Assay and Inhibition of Cellular Cholesterol Synthesis Assay
pH7.2±n/a
Temperature310.15±n/a K
IC50 2.2±1.0 nM
EC50 1.4±0.3 nM
Citation Pfefferkorn, JAChoi, CLarsen, SDAuerbach, BHutchings, RPark, WAskew, VDillon, LHanselman, JCLin, ZLu, GHRobertson, ASekerke, CHarris, MSPavlovsky, ABainbridge, GCaspers, NKowala, MTait, BD Substituted pyrazoles as hepatoselective HMG-CoA reductase inhibitors: discovery of (3R,5R)-7-[2-(4-fluoro-phenyl)-4-isopropyl-5-(4-methyl-benzylcarbamoyl)-2H-pyrazol-3-yl]-3,5-dihydroxyheptanoic acid (PF-3052334) as a candidate for the treatment of hypercholesterolemia. J Med Chem51:31-45 (2008) 
 
3-hydroxy-3-methylglutaryl-coenzyme A reductase
Name:3-hydroxy-3-methylglutaryl-coenzyme A reductase
Type:Enzyme
Mol. Mass.:96689.85
Organism:Rattus norvegicus (rat)
Description:Isolated rat liver microsomes were used as enzyme source.
Residue:887
BDBM20694
BDBM18373
NameBDBM20694
Synonyms:pyrazole-based inhibitor, 37 | sodium (3R,5R)-7-(3-{[(3-cyanophenyl)methyl]carbamoyl}-1-(4-fluorophenyl)-4-(propan-2-yl)-1H-pyrazol-5-yl)-3,5-dihydroxyheptanoate
TypeSmall organic molecule
Emp. Form.C28H30FN4O5
Mol. Mass.521.5606
SMILESCC(C)c1c(CC[C@@H](O)C[C@@H](O)CC([O-])=O)n(nc1C(=O)NCc1cccc(c1)C#N)-c1ccc(F)cc1