Reaction Details
TargetDiacylglycerol O-acyltransferase 1
LigandBDBM20719
Substrate/CompetitorBDBM20717
Meas. Tech.In Vitro FlashPlate Assay
pH7.5±n/a
Temperature295.15±n/a K
IC50 10±n/a nM
Citation Zhao, GSouers, AJVoorbach, MFalls, HDDroz, BBrodjian, SLau, YYIyengar, RRGao, JJudd, ASWagaw, SHRavn, MMEngstrom, KMLynch, JKMulhern, MMFreeman, JDayton, BDWang, XGrihalde, NFry, DBeno, DWMarsh, KCSu, ZDiaz, GJCollins, CASham, HReilly, RMBrune, MEKym, PR Validation of diacyl glycerolacyltransferase I as a novel target for the treatment of obesity and dyslipidemia using a potent and selective small molecule inhibitor. J Med Chem51:380-3 (2008) 
 
Diacylglycerol O-acyltransferase 1
Name:Diacylglycerol O-acyltransferase 1
Type:Protein
Mol. Mass.:55297.82
Organism:Homo sapiens (Human)
Description:O75907
Residue:488
BDBM20719
BDBM20717
NameBDBM20719
Synonyms:(1R,2R)-2-({4-[4-({[3-(trifluoromethyl)phenyl]carbamoyl}amino)phenyl]phenyl}carbonyl)cyclopentane-1-carboxylic acid | Urea-based Analogue, 4c
TypeSmall organic molecule
Emp. Form.C27H23F3N2O4
Mol. Mass.496.4777
SMILESOC(=O)[C@@H]1CCC[C@H]1C(=O)c1ccc(cc1)-c1ccc(NC(=O)Nc2cccc(c2)C(F)(F)F)cc1