Reaction Details
TargetDiacylglycerol O-acyltransferase 1
LigandBDBM20716
Substrate/CompetitorBDBM20717
Meas. Tech.In Vitro FlashPlate Assay
pH7.5±n/a
Temperature295.15±n/a K
IC50 24±n/a nM
Citation Zhao, GSouers, AJVoorbach, MFalls, HDDroz, BBrodjian, SLau, YYIyengar, RRGao, JJudd, ASWagaw, SHRavn, MMEngstrom, KMLynch, JKMulhern, MMFreeman, JDayton, BDWang, XGrihalde, NFry, DBeno, DWMarsh, KCSu, ZDiaz, GJCollins, CASham, HReilly, RMBrune, MEKym, PR Validation of diacyl glycerolacyltransferase I as a novel target for the treatment of obesity and dyslipidemia using a potent and selective small molecule inhibitor. J Med Chem51:380-3 (2008) 
 
Diacylglycerol O-acyltransferase 1
Name:Diacylglycerol O-acyltransferase 1
Type:Enzyme
Mol. Mass.:56810.61
Organism:Mus musculus (mouse)
Description:In this assay, recombinant mouse DGAT-1 containing an N-terminal His6-epitope tag was produced in the baculovirus expression system.
Residue:498
BDBM20716
BDBM20717
NameBDBM20716
Synonyms:(1R,2R)-2-[(4-{4-[(phenylcarbamoyl)amino]phenyl}phenyl)carbonyl]cyclopentane-1-carboxylic acid | Urea-based Analogue, 4a
TypeSmall organic molecule
Emp. Form.C26H24N2O4
Mol. Mass.428.4798
SMILESOC(=O)[C@@H]1CCC[C@H]1C(=O)c1ccc(cc1)-c1ccc(NC(=O)Nc2ccccc2)cc1