Reaction Details
TargetDiacylglycerol O-acyltransferase 1
LigandBDBM20724
Substrate/CompetitorBDBM20717
Meas. Tech.In Vitro FlashPlate Assay
pH7.5±n/a
Temperature295.15±n/a K
IC50 28±n/a nM
Citation Zhao, GSouers, AJVoorbach, MFalls, HDDroz, BBrodjian, SLau, YYIyengar, RRGao, JJudd, ASWagaw, SHRavn, MMEngstrom, KMLynch, JKMulhern, MMFreeman, JDayton, BDWang, XGrihalde, NFry, DBeno, DWMarsh, KCSu, ZDiaz, GJCollins, CASham, HReilly, RMBrune, MEKym, PR Validation of diacyl glycerolacyltransferase I as a novel target for the treatment of obesity and dyslipidemia using a potent and selective small molecule inhibitor. J Med Chem51:380-3 (2008) 
 
Diacylglycerol O-acyltransferase 1
Name:Diacylglycerol O-acyltransferase 1
Type:Enzyme
Mol. Mass.:56810.61
Organism:Mus musculus (mouse)
Description:In this assay, recombinant mouse DGAT-1 containing an N-terminal His6-epitope tag was produced in the baculovirus expression system.
Residue:498
BDBM20724
BDBM20717
NameBDBM20724
Synonyms:(1R,2R)-2-{[4-(4-{[(4-methoxyphenyl)carbamoyl]amino}phenyl)phenyl]carbonyl}cyclopentane-1-carboxylic acid | Urea-based Analogue, 4h
TypeSmall organic molecule
Emp. Form.C27H26N2O5
Mol. Mass.458.5057
SMILESCOc1ccc(NC(=O)Nc2ccc(cc2)-c2ccc(cc2)C(=O)[C@@H]2CCC[C@H]2C(O)=O)cc1