Reaction Details
TargetHeat shock protein HSP 90-beta
LigandBDBM20744
Substrate/CompetitorBDBM10852
Meas. Tech.Her-2 Degradation Assay
pH7.2±n/a
Temperature310.15±n/a K
EC50 3500±n/a nM
Citation Biamonte, MAShi, JHong, KHurst, DCZhang, LFan, JBusch, DJKarjian, PLMaldonado, AASensintaffar, JLYang, YCKamal, ALough, RELundgren, KBurrows, FJTimony, GABoehm, MFKasibhatla, SR Orally active purine-based inhibitors of the heat shock protein 90. J Med Chem49:817-28 (2006) 
 
Heat shock protein HSP 90-beta
Name:Heat shock protein HSP 90-beta
Type:Molecular Chaperone
Mol. Mass.:83229.45
Organism:Homo sapiens (Human)
Description:P08238
Residue:724
BDBM20744
BDBM10852
NameBDBM20744
Synonyms:8-sulfanyladenine analogue, 18 | 9-butyl-8-[(2,5-dimethoxyphenyl)sulfanyl]-9H-purin-6-amine
TypeSmall organic molecule
Emp. Form.C17H21N5O2S
Mol. Mass.359.446
SMILESCCCCn1c(Sc2cc(OC)ccc2OC)nc2c(N)ncnc12