Reaction Details
TargetFatty acid synthase
LigandBDBM244398
Substrate/Competitorn/a
Meas. Tech.FASN Inhibition
IC50 6.00±n/a nM
Citation Heuer, TSOslob, JDMcDowell, RSJohnson, RYang, HEvanchik, MZaharia, CACai, HHu, LWDuke, GOhol-Gupta, YO Farrell, M Heterocyclic modulators of lipid synthesis and combinations thereof US Patent US10226449 Publication Date 3/12/2019
 
Fatty acid synthase
Name:Fatty acid synthase
Type:Enzyme
Mol. Mass.:273419.37
Organism:Homo sapiens (Human)
Description:P49327
Residue:2511
BDBM244398
NameBDBM244398
Synonyms:US10226449, cpd 7 | US9428502, 7
TypeSmall organic molecule
Emp. Form.C22H19ClN4O
Mol. Mass.390.865
SMILESCc1nc(Cl)c([nH]1)-c1cc(ccc1C)C(=O)N1CC(C1)c1ccc(cc1)C#N