Reaction Details
TargetFatty acid synthase
LigandBDBM244404
Substrate/Competitorn/a
Meas. Tech.FASN Inhibition
IC50 6.00±n/a nM
Citation Heuer, TSOslob, JDMcDowell, RSJohnson, RYang, HEvanchik, MZaharia, CACai, HHu, LWDuke, GOhol-Gupta, YO Farrell, M Heterocyclic modulators of lipid synthesis and combinations thereof US Patent US10226449 Publication Date 3/12/2019
 
Fatty acid synthase
Name:Fatty acid synthase
Type:Enzyme
Mol. Mass.:273419.37
Organism:Homo sapiens (Human)
Description:P49327
Residue:2511
BDBM244404
NameBDBM244404
Synonyms:US10226449, cpd 13 | US9428502, 13
TypeSmall organic molecule
Emp. Form.C24H22ClFN4O
Mol. Mass.436.909
SMILESCc1nc(Cl)c([nH]1)-c1cc(ccc1C)C(=O)N1CCC(F)(CC1)c1ccc(cc1)C#N