Reaction Details
TargetFatty acid synthase
LigandBDBM244435
Substrate/Competitorn/a
Meas. Tech.FASN Inhibition
IC50 7.00±n/a nM
Citation Heuer, TSOslob, JDMcDowell, RSJohnson, RYang, HEvanchik, MZaharia, CACai, HHu, LWDuke, GOhol-Gupta, YO Farrell, M Heterocyclic modulators of lipid synthesis and combinations thereof US Patent US10226449 Publication Date 3/12/2019
 
Fatty acid synthase
Name:Fatty acid synthase
Type:Enzyme
Mol. Mass.:273419.37
Organism:Homo sapiens (Human)
Description:P49327
Residue:2511
BDBM244435
NameBDBM244435
Synonyms:US10226449, cpd 44 | US9428502, 44
TypeSmall organic molecule
Emp. Form.C24H21ClN4O
Mol. Mass.416.903
SMILESCc1ccc(cc1-c1[nH]c(nc1Cl)C1CC1)C(=O)N1CC(C1)c1ccc(cc1)C#N