Reaction Details
TargetHemagglutinin
LigandBDBM247024
Substrate/Competitorn/a
Meas. Tech.Endonuclease Assay
pH7.5±n/a
IC50 2000±n/a nM
Commentsextracted
Citation Lavoie, EJBauman, JDSagong, HYArnold, EParhi, ADas, KVijayan, SKPatel, D Therapeutic hydroxyquinolones US Patent US9701638 Publication Date 7/11/2017
 
Hemagglutinin
Name:Hemagglutinin
Type:Enzyme Catalytic Domain
Mol. Mass.:63281.44
Organism:Influenza A virus (strain swl A/California/04/2009 H1N1)
Description:C3W5S1
Residue:566
BDBM247024
NameBDBM247024
Synonyms:US9701638, 15
TypeSmall organic molecule
Emp. Form.C21H14FNO2
Mol. Mass.331.3398
SMILESOc1c(-c2ccccc2)c2ccc(cc2[nH]c1=O)-c1ccc(F)cc1