Reaction Details
TargetSerine/threonine-protein kinase MARK2
LigandBDBM247038
Substrate/Competitorn/a
Meas. Tech.PAR-1 FLIPR Assay
IC50 2.62±n/a nM
Citation Yang, ZZhang, FDong, GKnowles, SLMaletic, M Preparation and use of 7a-amide substituted- 6,6-difluoro bicyclic himbacine derivatives as PAR-1 receptor antagonists US Patent US9701669 Publication Date 7/11/2017
 
Serine/threonine-protein kinase MARK2
Name:Serine/threonine-protein kinase MARK2
Type:PROTEIN
Mol. Mass.:87953.09
Organism:Homo sapiens (Human)
Description:ChEMBL_774586
Residue:788
BDBM247038
NameBDBM247038
Synonyms:2-((1R,3aR, 6S,7R,7aS)-5,5- difluoro-7- ((E)-2-(5-(3- fluorophenyl) pyridin-2- yl)vinyl)-1,6- dimethyl-3- oxooctahydro- isobenzofuran- 3a-yl)acetamide | US9701669, 6
TypeSmall organic molecule
Emp. Form.C25H25F3N2O3
Mol. Mass.458.4728
SMILESC[C@H]1OC(=O)[C@]2(CC(N)=O)CC(F)(F)[C@@H](C)[C@H](\C=C\c3ccc(cn3)-c3cccc(F)c3)[C@H]12