Reaction Details
TargetSerine/threonine-protein kinase MARK2
LigandBDBM247047
Substrate/Competitorn/a
Meas. Tech.PAR-1 FLIPR Assay
IC50 4.41±n/a nM
Citation Yang, ZZhang, FDong, GKnowles, SLMaletic, M Preparation and use of 7a-amide substituted- 6,6-difluoro bicyclic himbacine derivatives as PAR-1 receptor antagonists US Patent US9701669 Publication Date 7/11/2017
 
Serine/threonine-protein kinase MARK2
Name:Serine/threonine-protein kinase MARK2
Type:PROTEIN
Mol. Mass.:87953.09
Organism:Homo sapiens (Human)
Description:ChEMBL_774586
Residue:788
BDBM247047
NameBDBM247047
Synonyms:(S and R)-2- ((1R,3aR,6S, 7R,7aS)-7- ((E)-2-(5-(2- cyanophenyl) pyridin-2- yl)vinyl)- 5,5-difluoro- 1,6-dimethyl-3- oxooctahydro- isobenzofuran- 3a-yl)-2- hydroxyacetamide | US9701669, 20
TypeSmall organic molecule
Emp. Form.C26H25F2N3O4
Mol. Mass.481.4912
SMILESC[C@H]1OC(=O)[C@@]2(CC(F)(F)[C@@H](C)[C@H](\C=C\c3ccc(cn3)-c3ccccc3C#N)[C@H]12)C(O)C(N)=O