Reaction Details
TargetPotassium voltage-gated channel subfamily H member 2
LigandBDBM247036
Substrate/Competitorn/a
Meas. Tech.MK-499 Filter Binding Assay
pH7.4±n/a
Temperature298.15±n/a K
IC50 12000±n/a nM
Commentsextracted
Citation Yang, ZZhang, FDong, GKnowles, SLMaletic, M Preparation and use of 7a-amide substituted- 6,6-difluoro bicyclic himbacine derivatives as PAR-1 receptor antagonists US Patent US9701669 Publication Date 7/11/2017
 
Potassium voltage-gated channel subfamily H member 2
Name:Potassium voltage-gated channel subfamily H member 2
Type:Multi-pass membrane protein
Mol. Mass.:126672.65
Organism:Homo sapiens (Human)
Description:Q12809
Residue:1159
BDBM247036
NameBDBM247036
Synonyms:(1R,3aR, 6S,7R,7aS)- 5,5-difluoro- 7-((E)-2-(5- (3-fluoro-2- methylphenyl) pyridin-2- yl)vinyl)-1,6- dimethyl-3- oxooctahydro- isobenzofuran- 3a- carboxamide | US9701669, 3
TypeSmall organic molecule
Emp. Form.C25H25F3N2O3
Mol. Mass.458.4728
SMILESC[C@H]1OC(=O)[C@@]2(CC(F)(F)[C@@H](C)[C@H](\C=C\c3ccc(cn3)-c3cccc(F)c3C)[C@H]12)C(N)=O