Reaction Details
TargetPotassium voltage-gated channel subfamily H member 2
LigandBDBM247043
Substrate/Competitorn/a
Meas. Tech.MK-499 Filter Binding Assay
pH7.4±n/a
Temperature298.15±n/a K
IC50 3000±n/a nM
Commentsextracted
Citation Yang, ZZhang, FDong, GKnowles, SLMaletic, M Preparation and use of 7a-amide substituted- 6,6-difluoro bicyclic himbacine derivatives as PAR-1 receptor antagonists US Patent US9701669 Publication Date 7/11/2017
 
Potassium voltage-gated channel subfamily H member 2
Name:Potassium voltage-gated channel subfamily H member 2
Type:Multi-pass membrane protein
Mol. Mass.:126672.65
Organism:Homo sapiens (Human)
Description:Q12809
Residue:1159
BDBM247043
NameBDBM247043
Synonyms:1-((1R,3aS,6S, 7R,7aS)-5,5- difluoro-7- ((E)-2-(5-(3- fluorophenyl) pyridin-2- yl)vinyl)-1,6- dimethyl-3- oxo-octahydro- isobenzofuran- 3a-yl)azetidine- 3-carboxamide | US9701669, 13
TypeSmall organic molecule
Emp. Form.C27H28F3N3O3
Mol. Mass.499.5247
SMILESC[C@H]1OC(=O)[C@@]2(CC(F)(F)[C@@H](C)[C@H](\C=C\c3ccc(cn3)-c3cccc(F)c3)[C@H]12)N1CC(C1)C(N)=O