Reaction Details
TargetDelta-type opioid receptor
LigandBDBM21117
Substrate/CompetitorBDBM21008
Meas. Tech.Radioligand Labeled Binding Assay and [35S]GTP-gamma-S Binding Assay
pH7.4±n/a
Temperature298.15±n/a K
Ki 6.1±n/a nM
EC50 110±n/a nM
Citation Lee, YSPetrov, RPark, CKMa, SWDavis, PLai, JPorreca, FVardanyan, RHruby, VJ Development of novel enkephalin analogues that have enhanced opioid activities at both mu and delta opioid receptors. J Med Chem50:5528-32 (2007) 
 
Delta-type opioid receptor
Name:Delta-type opioid receptor
Type:G Protein-Coupled Receptor (GPCR)
Mol. Mass.:40382.98
Organism:Homo sapiens (Human)
Description:Competition binding assays were carried out using membrane preparations from transfected HN9.10 cells that constitutively expressed the delta opioid receptor.
Residue:372
BDBM21117
BDBM21008
NameBDBM21117
Synonyms:3-{N'-[(2S)-2-{2-[(2R)-2-[(2S)-2-amino-3-(4-hydroxyphenyl)propanamido]propanamido]acetamido}-3-phenylpropanoyl]hydrazinecarbonyl}-N-phenyl-N-[1-(2-phenylethyl)piperidin-4-yl]propanamide | 4-anilidopiperidine, 12
TypePeptide-like ligand
Emp. Form.C46H56N8O7
Mol. Mass.832.9862
SMILESC[C@@H](NC(=O)[C@@H](N)Cc1ccc(O)cc1)C(=O)NCC(=O)N[C@@H](Cc1ccccc1)C(=O)NNC(=O)CCC(=O)N(C1CCN(CCc2ccccc2)CC1)c1ccccc1