Reaction Details
TargetDelta-type opioid receptor
LigandBDBM21119
Substrate/CompetitorBDBM21008
Meas. Tech.Radioligand Labeled Binding Assay and [35S]GTP-gamma-S Binding Assay
pH7.4±n/a
Temperature298.15±n/a K
Ki 0.69±n/a nM
EC50 37±n/a nM
Citation Lee, YSPetrov, RPark, CKMa, SWDavis, PLai, JPorreca, FVardanyan, RHruby, VJ Development of novel enkephalin analogues that have enhanced opioid activities at both mu and delta opioid receptors. J Med Chem50:5528-32 (2007) 
 
Delta-type opioid receptor
Name:Delta-type opioid receptor
Type:G Protein-Coupled Receptor (GPCR)
Mol. Mass.:40382.98
Organism:Homo sapiens (Human)
Description:Competition binding assays were carried out using membrane preparations from transfected HN9.10 cells that constitutively expressed the delta opioid receptor.
Residue:372
BDBM21119
BDBM21008
NameBDBM21119
Synonyms:(2S)-2-amino-3-(4-hydroxyphenyl)-N-[(1R)-1-[({[(2S)-1-oxo-3-phenyl-1-[4-(N-phenylpropanamido)piperidin-1-yl]propan-2-yl]carbamoyl}methyl)carbamoyl]ethyl]propanamide | 4-anilidopiperidine, 14
TypePeptide-like ligand
Emp. Form.C37H46N6O6
Mol. Mass.670.7977
SMILESCCC(=O)N(C1CCN(CC1)C(=O)[C@H](Cc1ccccc1)NC(=O)CNC(=O)[C@@H](C)NC(=O)[C@@H](N)Cc1ccc(O)cc1)c1ccccc1