Reaction Details
TargetMu-type opioid receptor
LigandBDBM21120
Substrate/CompetitorBDBM21015
Meas. Tech.Radioligand Labeled Binding Assay and [35S]GTP-gamma-S Binding Assay
pH7.4±n/a
Temperature298.15±n/a K
Ki 40±n/a nM
EC50 82±n/a nM
Citation Lee, YSPetrov, RPark, CKMa, SWDavis, PLai, JPorreca, FVardanyan, RHruby, VJ Development of novel enkephalin analogues that have enhanced opioid activities at both mu and delta opioid receptors. J Med Chem50:5528-32 (2007) 
 
Mu-type opioid receptor
Name:Mu-type opioid receptor
Type:G Protein-Coupled Receptor (GPCR)
Mol. Mass.:44503.11
Organism:Rattus norvegicus (rat)
Description:Competition binding assays were carried out using membrane preparations from transfected HN9.10 cells that constitutively expressed the mu opioid receptor.
Residue:398
BDBM21120
BDBM21015
NameBDBM21120
Synonyms:(2S)-2-amino-3-(4-hydroxy-3,5-dimethylphenyl)-N-[(1R)-1-({2-oxo-2-[4-(N-phenylpropanamido)piperidin-1-yl]ethyl}carbamoyl)ethyl]propanamide | 4-anilidopiperidine, 15
TypePeptide-like ligand
Emp. Form.C30H41N5O5
Mol. Mass.551.677
SMILESCCC(=O)N(C1CCN(CC1)C(=O)CNC(=O)[C@@H](C)NC(=O)[C@@H](N)Cc1cc(C)c(O)c(C)c1)c1ccccc1