Reaction Details
TargetCannabinoid receptor 1
LigandBDBM21292
Substrate/CompetitorBDBM21244
Meas. Tech.Radioligand Binding Assay
pH7.4±n/a
Temperature303.15±n/a K
Ki 70±n/a nM
Citation Frost, JMDart, MJTietje, KRGarrison, TRGrayson, GKDaza, AVEl-Kouhen, OFMiller, LNLi, LYao, BBHsieh, GCPai, MZhu, CZChandran, PMeyer, MD Indol-3-yl-tetramethylcyclopropyl Ketones: Effects of Indole Ring Substitution on CB2 Cannabinoid Receptor Activity. J Med Chem51:1904-12 (2008) 
 
Cannabinoid receptor 1
Name:Cannabinoid receptor 1
Type:G Protein-Coupled Receptor (GPCR)
Mol. Mass.:52868.96
Organism:Homo sapiens (Human)
Description:P21554
Residue:472
BDBM21292
BDBM21244
NameBDBM21292
Synonyms:1-(oxan-4-ylmethyl)-3-[(2,2,3,3-tetramethylcyclopropyl)carbonyl]-6-(trifluoromethyl)-1H-indole | Tetrahydropyranyl-methyl analogue, 13
TypeSmall organic molecule
Emp. Form.C23H28F3NO2
Mol. Mass.407.4691
SMILESCC1(C)C(C(=O)c2cn(CC3CCOCC3)c3cc(ccc23)C(F)(F)F)C1(C)C