Reaction Details
TargetCannabinoid receptor 1
LigandBDBM21299
Substrate/CompetitorBDBM21244
Meas. Tech.Radioligand Binding Assay
pH7.4±n/a
Temperature303.15±n/a K
Ki 282±n/a nM
Citation Frost, JMDart, MJTietje, KRGarrison, TRGrayson, GKDaza, AVEl-Kouhen, OFMiller, LNLi, LYao, BBHsieh, GCPai, MZhu, CZChandran, PMeyer, MD Indol-3-yl-tetramethylcyclopropyl Ketones: Effects of Indole Ring Substitution on CB2 Cannabinoid Receptor Activity. J Med Chem51:1904-12 (2008) 
 
Cannabinoid receptor 1
Name:Cannabinoid receptor 1
Type:G Protein-Coupled Receptor (GPCR)
Mol. Mass.:52868.96
Organism:Homo sapiens (Human)
Description:P21554
Residue:472
BDBM21299
BDBM21244
NameBDBM21299
Synonyms:5-methoxy-1-(oxan-4-ylmethyl)-3-[(2,2,3,3-tetramethylcyclopropyl)carbonyl]-1H-indole | Tetrahydropyranyl-methyl analogue, 20
TypeSmall organic molecule
Emp. Form.C23H31NO3
Mol. Mass.369.4971
SMILESCOc1ccc2n(CC3CCOCC3)cc(C(=O)C3C(C)(C)C3(C)C)c2c1