Reaction Details
TargetCannabinoid receptor 1
LigandBDBM21315
Substrate/CompetitorBDBM21244
Meas. Tech.Radioligand Binding Assay
Ki 1285±n/a nM
Citation Frost, JMDart, MJTietje, KRGarrison, TRGrayson, GKDaza, AVEl-Kouhen, OFMiller, LNLi, LYao, BBHsieh, GCPai, MZhu, CZChandran, PMeyer, MD Indol-3-yl-tetramethylcyclopropyl Ketones: Effects of Indole Ring Substitution on CB2 Cannabinoid Receptor Activity. J Med Chem51:1904-12 (2008) 
 
Cannabinoid receptor 1
Name:Cannabinoid receptor 1
Type:G Protein-Coupled Receptor (GPCR)
Mol. Mass.:52868.96
Organism:Homo sapiens (Human)
Description:P21554
Residue:472
BDBM21315
BDBM21244
NameBDBM21315
Synonyms:4-(2-{6-methoxy-3-[(2,2,3,3-tetramethylcyclopropyl)carbonyl]-1H-indol-1-yl}ethyl)morpholine | Morpholino-ethyl analogue, 36
TypeSmall organic molecule
Emp. Form.C23H32N2O3
Mol. Mass.384.5118
SMILESCOc1ccc2c(cn(CCN3CCOCC3)c2c1)C(=O)C1C(C)(C)C1(C)C