Reaction Details
TargetCannabinoid receptor 1
LigandBDBM21326
Substrate/CompetitorBDBM21244
Meas. Tech.Radioligand Binding Assay
Ki>10000±n/a nM
Citation Frost, JMDart, MJTietje, KRGarrison, TRGrayson, GKDaza, AVEl-Kouhen, OFMiller, LNLi, LYao, BBHsieh, GCPai, MZhu, CZChandran, PMeyer, MD Indol-3-yl-tetramethylcyclopropyl Ketones: Effects of Indole Ring Substitution on CB2 Cannabinoid Receptor Activity. J Med Chem51:1904-12 (2008) 
 
Cannabinoid receptor 1
Name:Cannabinoid receptor 1
Type:G Protein-Coupled Receptor (GPCR)
Mol. Mass.:52868.96
Organism:Homo sapiens (Human)
Description:P21554
Residue:472
BDBM21326
BDBM21244
NameBDBM21326
Synonyms:Tetrahydropyranyl-methyl analogue, 47 | [1-(oxan-4-ylmethyl)-3-[(2,2,3,3-tetramethylcyclopropyl)carbonyl]-1H-indol-5-yl]methanamine
TypeSmall organic molecule
Emp. Form.C23H32N2O2
Mol. Mass.368.5124
SMILESCC1(C)C(C(=O)c2cn(CC3CCOCC3)c3ccc(CN)cc23)C1(C)C